GSI Forum
GSI Helmholtzzentrum für Schwerionenforschung

Home » PANDA » PandaRoot » General » Error in PandaRootdec17 installation
Re: Error in PandaRootdec17 installation [message #22939 is a reply to message #22929] Wed, 12 September 2018 16:11 Go to previous messageGo to previous message
Anna Skachkova is currently offline  Anna Skachkova
Messages: 37
Registered: September 2018
continuous participant
From: *jinr.ru
without the option -j4:

~/WORK/PandaRoot/fairsoft_may18/pandaroot_dec17/buildPanda$ make
-- Found Git: /usr/bin/git (found version "2.18.0")
[ 0%] Built target svnheader
[ 1%] Built target vc
[ 7%] Built target PndData
[ 8%] Built target generalTools
[ 8%] Built target buffers
[ 9%] Built target Passive
[ 11%] Built target Field
[ 11%] Built target DpmEvtGen
[ 11%] Generating G__PGenDict.cxx, G__PGenDict_rdict.pcm, ../lib/libPGen.rootmap
input_line_12:1493:10: fatal error: 'Riosfwd.h' file not found
#include "Riosfwd.h" // for ostream
^~~~~~~~~~~
Error: /home/anna/WORK/PandaRoot/fairsoft_may18/buildFairSoft/bin/rootcint: compilation failure (/home/anna/WORK/PandaRoot/fairsoft_may18/pandaroot_dec17/buildPanda/pge nerators/G__PGenDictf2ce421b8c_dictUmbrella.h)
pgenerators/CMakeFiles/PGen.dir/build.make:85:runtime error prescription for the purpose «pgenerators/G__PGenDict.cxx»
make[2]: *** [pgenerators/G__PGenDict.cxx] Error 1
CMakeFiles/Makefile2:1349: runtime error prescription for the purpose «pgenerators/CMakeFiles/PGen.dir/all»
make[1]: *** [pgenerators/CMakeFiles/PGen.dir/all] Error 2
Makefile:140: runtime error prescription for the purpose «all»
make: *** [all] Error 2

 
Read Message
Read Message
Read Message
Read Message
Read Message
Read Message
Read Message
Read Message
Read Message
Read Message
Read Message
Read Message
Read Message
Read Message
Read Message
Read Message
Read Message
Read Message
Read Message
Read Message
Read Message
Read Message
Read Message
Read Message
Read Message
Read Message
Read Message
Read Message
Read Message
Read Message
Read Message
Read Message
Read Message
Previous Topic: Failed FairSoft (for analysis) Installation on Ubuntu 18.04 LTS
Next Topic: cann't start
Goto Forum:
  


Current Time: Fri Jul 19 00:40:45 CEST 2024

Total time taken to generate the page: 0.00877 seconds