GSI Forum
GSI Helmholtzzentrum für Schwerionenforschung

Home » Fairroot » External Packages » problems with installation of external packages
problems with installation of external packages [message #22900] Thu, 06 September 2018 12:53 Go to previous message
Anna Skachkova is currently offline  Anna Skachkova
Messages: 37
Registered: September 2018
continuous participant
From: *jinr.ru

Dear colleagues,

I have a problem with installation of external packages on my PC under Ubuntu.

With version may16p1 the problems are the next:

ath/mathcore/CMakeFiles/MathCore.dir/build.make:361: runtime error prescription for the purpose «math/mathcore/CMakeFiles/MathCore.dir/src/mixmax.cxx.o»
make[2]: *** [math/mathcore/CMakeFiles/MathCore.dir/src/mixmax.cxx.o] Error 1
CMakeFiles/Makefile2:12664: runtime error prescription for the purpose «math/mathcore/CMakeFiles/MathCore.dir/all»
make[1]: *** [math/mathcore/CMakeFiles/MathCore.dir/all] Error 2
Makefile:149: runtime error prescription for the purpose «all»
make: *** [all] Error 2
**** Checking libraries in /home/anna/WORK/PandaRoot/buildFairSoft_may16p1/lib ****
*** ERROR: root could not be created.
create a symbolic linking for Vc library ....
libVc.a not found in lib dirctory
*** End installation of external packages with Errors***

With the version oct17 the problems are:

[ 52%] Building CXX object core/rootcling_stage1/CMakeFiles/rootcling_stage1.dir/src/rootcling_stag e1.cxx.o
[ 52%] Linking CXX executable src/rootcling_stage1
collect2: fatal error: ld terminated with signal 9 [Killed]
compilation terminated.
core/rootcling_stage1/CMakeFiles/rootcling_stage1.dir/build.make:210: runtime error prescription for the purpose «core/rootcling_stage1/src/rootcling_stage1»
make[2]: *** [core/rootcling_stage1/src/rootcling_stage1] Error 1
make[2]: *** Removed file «core/rootcling_stage1/src/rootcling_stage1»
CMakeFiles/Makefile2:17556: runtime error prescription for the purpose «core/rootcling_stage1/CMakeFiles/rootcling_stage1.dir/all»
make[1]: *** [core/rootcling_stage1/CMakeFiles/rootcling_stage1.dir/all] Error 2
Makefile:151: runtime error prescription for the purpose «all»
make: *** [all] Error 2
**** Checking libraries in /home/anna/WORK/PandaRoot/fairsoft_oct17/buildFairSoft/lib ****
*** ERROR: root could not be created.
create a symbolic linking for Vc library ....
libVc.a not found in lib dirctory
*** End installation of external packages with Errors***

What could be the reason? What to do?

Thank you in advance,
Anna
 
Read Message
Read Message
Read Message
Read Message
Read Message
Previous Topic: installing FairSoft without graphic libraries
Next Topic: CMake Error at source/python3/cmake_install.cmake:51 (file): *** ERROR: g4py could not be created.
Goto Forum:
  


Current Time: Sat Jun 19 18:03:46 CEST 2021

Total time taken to generate the page: 0.02187 seconds