GSI Forum
GSI Helmholtzzentrum für Schwerionenforschung

Home » PANDA » PandaRoot » Bugs, Fixes, Releases » problem in compilation of pandaroot trunk version
problem in compilation of pandaroot trunk version [message #19539] Tue, 13 September 2016 10:44 Go to previous message
Alexandros is currently offline  Alexandros
Messages: 51
Registered: January 2014
Location: KVI
continuous participant
From: *kvi-cart.rug.nl
Hi all,

After I tried and succeeded to install fairsoft and fairroot I am trying to install pandaroot.
During the compilation I get this error message.
I think it has to do with a library missing.
In order to install the external packages etc., I am pretty sure I did not include the Vc libraries.
Is there a way to succesfully finish the compilation?
This is the error I get:
[ 95%] Built target Tracking
[ 95%] Building CXX object catracking/CMakeFiles/CATracking.dir/code/PndCAFunctionality.cxx.o
In file included from /home/apostolou/pandaroot/catracking/code/PndCAVector.h:20:0,
from /home/apostolou/pandaroot/catracking/code/PndCAFunctionality.h:12,
from /home/apostolou/pandaroot/catracking/code/PndCAFunctionality.cxx:9:
/home/apostolou/pandaroot/catracking/code/PndCADef.h:14:17: fatal error: Vc/Vc: No such file or directory
compilation terminated.
make[2]: *** [catracking/CMakeFiles/CATracking.dir/code/PndCAFunctionality.cxx.o] Error 1
make[2]: *** Waiting for unfinished jobs....
[ 95%] Building CXX object hyp/CMakeFiles/Hyp.dir/hypDigi/PndHypStripDigiPar.cxx.o
[ 95%] Built target LmdSensorAligner
[ 95%] Building CXX object scitil/CMakeFiles/SciT.dir/SciTDigi/PndSciTHitProducerIdeal.cxx.o
In file included from /home/apostolou/pandaroot/catracking/code/PndCATrackParam.h:14:0,
from /home/apostolou/pandaroot/catracking/PndCATracking.cxx:54:
/home/apostolou/pandaroot/catracking/code/PndCADef.h:14:17: fatal error: Vc/Vc: No such file or directory
compilation terminated.
make[2]: *** [catracking/CMakeFiles/CATracking.dir/PndCATracking.cxx.o] Error 1
make[1]: *** [catracking/CMakeFiles/CATracking.dir/all] Error 2
make[1]: *** Waiting for unfinished jobs....
[ 95%] Building CXX object scitil/CMakeFiles/SciT.dir/SciTDigi/PndSciTDigiTask.cxx.o
[ 95%] Building CXX object scitil/CMakeFiles/SciT.dir/SciTDigi/PndSciTHitWriteoutBuffer.cxx.o
[ 95%] Building CXX object hyp/CMakeFiles/Hyp.dir/hypReco/PndHypIdealRecoTask.cxx.o
[ 95%] Building CXX object hyp/CMakeFiles/Hyp.dir/hypReco/PndHypStripClusterBuilder.cxx.o
[ 95%] Building CXX object scitil/CMakeFiles/SciT.dir/SciTDigi/PndSciTHitSorterTask.cxx.o
[ 96%] Building CXX object scitil/CMakeFiles/SciT.dir/SciTDigi/PndSciTHitRingSorter.cxx.o
[ 96%] Building CXX object hyp/CMakeFiles/Hyp.dir/hypReco/PndHypStripClusterTask.cxx.o
[ 96%] Building CXX object scitil/CMakeFiles/SciT.dir/G__SciTDict.cxx.o
[ 96%] Building CXX object hyp/CMakeFiles/Hyp.dir/hypTools/PndHypGeoHandling.cxx.o
[ 96%] Building CXX object hyp/CMakeFiles/Hyp.dir/hypTools/PndStringVector.cxx.o
[ 96%] Building CXX object hyp/CMakeFiles/Hyp.dir/hypPID/PndHypAdvancedPidAlgo.cxx.o
[ 96%] Building CXX object hyp/CMakeFiles/Hyp.dir/hypPID/PndHypPidIdealTask.cxx.o
[ 96%] Building CXX object hyp/CMakeFiles/Hyp.dir/G__HypDict.cxx.o
Linking CXX shared library ../lib/libSciT.so
[ 96%] Built target SciT
Linking CXX shared library ../lib/libHyp.so
[ 97%] Built target Hyp
make: *** [all] Error 2

Thank you in advance.
 
Read Message
Read Message
Read Message
Read Message
Read Message
Read Message
Read Message
Previous Topic: New dev suggested version
Next Topic: Problem with GenFit2 libraries
Goto Forum:
  


Current Time: Mon Oct 25 21:54:30 CEST 2021

Total time taken to generate the page: 0.02324 seconds