GSI Forum
GSI Helmholtzzentrum für Schwerionenforschung

Home » CBM » CBMROOT » General » Error while compiling CBM JUN16 root (Error while compiling CBM JUN16 root )
Error while compiling CBM JUN16 root [message #19451] Fri, 19 August 2016 10:32 Go to previous message
Sudhir is currently offline  Sudhir
Messages: 6
Registered: July 2016
occasional visitor
From: 125.21.19*
Hello,



I am installing CBM root version JUN16. I am installed FairSoft and FairRoot. Versions of these two are as per release version i.e. FairRoot version: v-15.11e, FairSoft version: nov15p6 (ROOT5). But when I am trying to install cbm root then during building it is giving me following error.

g++: error: unrecognized command line option '--no-as-needed'
g++: error: unrecognized command line option '--no-as-needed'
make[2]: *** [bin/runStsSplitter] Error 1
make[1]: make[2]: *** [bin/runStsMerger] Error 1
*** [tutorials/cbmMQTest/CMakeFiles/runStsSplitter.dir/all] Error 2
make[1]: *** Waiting for unfinished jobs....
make[1]: *** [tutorials/cbmMQTest/CMakeFiles/runStsMerger.dir/all] Error 2


and



g++: error: unrecognized command line option '--no-as-needed'
make[2]: *** [bin/runCbmMQFileSink] Error 1
make[1]: *** [tutorials/cbmMQTest/CMakeFiles/runCbmMQFileSink.dir/all] Error 2



So please Can anyone help me?

 
Read Message
Read Message
Read Message
Read Message
Previous Topic: Secondary tracks in the PSD
Next Topic: Error while opening Primary Vertex branch of Tree in CBM root
Goto Forum:
  


Current Time: Sat Oct 16 19:45:22 CEST 2021

Total time taken to generate the page: 0.02533 seconds