GSI Forum
GSI Helmholtzzentrum für Schwerionenforschung

Home » R3BRoot » Installation and Compilation » FairRoot installation fails on Mac
FairRoot installation fails on Mac [message #18647] Thu, 05 November 2015 08:32 Go to previous message
Valerii is currently offline  Valerii
Messages: 3
Registered: November 2015
Location: Japan
occasional visitor
From: *riken.go.jp
Hi,

I am trying to install FairRoot-v-15.07 on my Mac (Os X El Captain 10.11.1), following the instructions on https://www.r3broot.gsi.de/fairroot-installation
The FairSoft-jul15p1 has been successfully installed before, after fixing the problem as explained in another post:
https://forum.gsi.de/index.php?t=tree&th=4709&start=0&

While executing 'make' command I get the following error:

...
Scanning dependencies of target fileSinkBoost
[ 69%] Building CXX object example/Tutorial3/CMakeFiles/fileSinkBoost.dir/run/runFileSinkBoost.cxx. o
[ 69%] Linking CXX executable ../../bin/fileSinkBoost
Undefined symbols for architecture x86_64:
"boost::archive::basic_binary_iarchive<boost::archive::binary_iarchive>::load_override(boost::archive::class_name_type&) ", referenced from:
boost::archive::detail::common_iarchive<boost::archive::binary_iarchive >::vload(boost::archive::class_name_type&) in runFileSinkBoost.cxx.o
ld: symbol(s) not found for architecture x86_64
clang: error: linker command failed with exit code 1 (use -v to see invocation)
make[2]: *** [bin/fileSinkBoost] Error 1
make[1]: *** [example/Tutorial3/CMakeFiles/fileSinkBoost.dir/all] Error 2
make: *** [all] Error 2
 
Read Message
Read Message
Read Message
Read Message
Read Message
Read Message
Previous Topic: Geant4 compilation problem with Xcode 7
Next Topic: Compilation fails
Goto Forum:
  


Current Time: Fri Jun 25 14:34:28 CEST 2021

Total time taken to generate the page: 0.02242 seconds