GSI Forum
GSI Helmholtzzentrum für Schwerionenforschung

Home » PANDA » PandaRoot » Bugs, Fixes, Releases » Problem on installing pandaroot
icon4.gif  Problem on installing pandaroot [message #17649] Sat, 13 December 2014 11:00 Go to previous message
kamalpdutta is currently offline  kamalpdutta
Messages: 30
Registered: December 2014
Location: Guwahati, India
continuous participant
From: 14.139.207*
Dear all,

I have been trying to install pandaroot trunk version with While using make command, I am getting the following errors and the installation stops.

[ 76%] Building CXX object sds/CMakeFiles/SdsReco.dir/SdsReco/PndSdsIdealPixelClusterFinder.cxx.o
/home/kamalpdutta/PANDA/pandaroot/sds/SdsDigi/ x: In member function 'virtual void PndSdsHybridHitProducer::Exec(Option_t*)':
/home/kamalpdutta/PANDA/pandaroot/sds/SdsDigi/ x:388:39: error: 'FairMultiLinkedData_Interface' was not declared in this scope
std::cout << "Links in Digi: " << (FairMultiLinkedData_Interface*)(tempPixel) << std::endl;
/home/kamalpdutta/PANDA/pandaroot/sds/SdsDigi/ x:388:69: error: expected primary-expression before ')' token
std::cout << "Links in Digi: " << (FairMultiLinkedData_Interface*)(tempPixel) << std::endl;
make[2]: *** [sds/CMakeFiles/Sds.dir/SdsDigi/PndSdsHybridHitProducer.cxx.o] Error 1
make[1]: *** [sds/CMakeFiles/Sds.dir/all] Error 2
make[1]: *** Waiting for unfinished jobs....
[ 76%] Building CXX object sds/CMakeFiles/SdsReco.dir/SdsReco/PndSdsPixelClusterTask.cxx.o
[ 76%] Building CXX object sds/CMakeFiles/SdsReco.dir/SdsReco/PndSdsIdealClusterTask.cxx.o
/home/kamalpdutta/PANDA/pandaroot/sds/SdsReco/PndSdsPixelClusterTask.cxx : In member function 'virtual void PndSdsPixelClusterTask::Exec(Option_t*)':
/home/kamalpdutta/PANDA/pandaroot/sds/SdsReco/PndSdsPixelClusterTask.cxx :250:6: error: 'FairMultiLinkedData_Interface' was not declared in this scope
make[2]: *** [sds/CMakeFiles/SdsReco.dir/SdsReco/PndSdsPixelClusterTask.cxx.o] Error 1
make[2]: *** Waiting for unfinished jobs....
make[1]: *** [sds/CMakeFiles/SdsReco.dir/all] Error 2
make: *** [all] Error 2

Please someone help me in debuggig this error.


Kamal Dutta
Read Message icon4.gif
Read Message
Read Message icon4.gif
Read Message
Read Message icon4.gif
Read Message
Previous Topic: [FIXED] Bug in PndDipoleMap
Next Topic: [NOTSUPPORTED] Pandaroot not compiling (with fix)
Goto Forum:

Current Time: Mon Jun 17 00:55:36 CEST 2024

Total time taken to generate the page: 0.00889 seconds