GSI Forum
GSI Helmholtzzentrum für Schwerionenforschung

Home » PANDA » PandaRoot » Bugs, Fixes, Releases » [FIXED] Problems in compiling EvtGenDirect
Re: Problems in compiling EvtGenDirect [message #14797 is a reply to message #14796] Fri, 24 May 2013 15:56 Go to previous messageGo to previous message
StefanoSpataro is currently offline  StefanoSpataro
Messages: 2736
Registered: June 2005
Location: Torino
first-grade participant

From: 2.235.190*
Sure!

[ 45%] Built target EvtGen_exe_simpleEvtGen
make -f pgenerators/EvtGen/CMakeFiles/EvtGen_exe_simpleEvtGenRO.dir/build.make pgenerators/EvtGen/CMakeFiles/EvtGen_exe_simpleEvtGenRO.dir/depend
cd /Users/spataro/apr13/build && /Users/spataro/sep12/sep12build/bin/cmake -E cmake_depends "Unix Makefiles" /Users/spataro/apr13/pandaroot /Users/spataro/apr13/pandaroot/pgenerators/EvtGen /Users/spataro/apr13/build /Users/spataro/apr13/build/pgenerators/EvtGen /Users/spataro/apr13/build/pgenerators/EvtGen/CMakeFiles/EvtGen_exe_simpleEvtGenRO.dir/DependInfo.cmake --color=
make -f pgenerators/EvtGen/CMakeFiles/EvtGen_exe_simpleEvtGenRO.dir/build.make pgenerators/EvtGen/CMakeFiles/EvtGen_exe_simpleEvtGenRO.dir/build
make[2]: Nothing to be done for `pgenerators/EvtGen/CMakeFiles/EvtGen_exe_simpleEvtGenRO.dir/build'.
/Users/spataro/sep12/sep12build/bin/cmake -E cmake_progress_report /Users/spataro/apr13/build/CMakeFiles 
[ 45%] Built target EvtGen_exe_simpleEvtGenRO
make -f pgenerators/EvtGenDirect/CMakeFiles/EvtGenDirect.dir/build.make pgenerators/EvtGenDirect/CMakeFiles/EvtGenDirect.dir/depend
cd /Users/spataro/apr13/build && /Users/spataro/sep12/sep12build/bin/cmake -E cmake_depends "Unix Makefiles" /Users/spataro/apr13/pandaroot /Users/spataro/apr13/pandaroot/pgenerators/EvtGenDirect /Users/spataro/apr13/build /Users/spataro/apr13/build/pgenerators/EvtGenDirect /Users/spataro/apr13/build/pgenerators/EvtGenDirect/CMakeFiles/EvtGenDirect.dir/DependInfo.cmake --color=
make -f pgenerators/EvtGenDirect/CMakeFiles/EvtGenDirect.dir/build.make pgenerators/EvtGenDirect/CMakeFiles/EvtGenDirect.dir/build
Linking CXX shared library ../../lib/libEvtGenDirect.so
cd /Users/spataro/apr13/build/pgenerators/EvtGenDirect && /Users/spataro/sep12/sep12build/bin/cmake -E cmake_link_script CMakeFiles/EvtGenDirect.dir/link.txt --verbose=1
/usr/bin/c++  -m64 -g -O2 -Wshadow  -fno-inline -shared -flat_namespace -single_module -undefined dynamic_lookup   -o ../../lib/libEvtGenDirect.0.0.0.so -install_name /Users/spataro/apr13/build/lib/libEvtGenDirect.0.so CMakeFiles/EvtGenDirect.dir/PndEvtGenDirect.cxx.o CMakeFiles/EvtGenDirect.dir/G__EvtGenDirectDict.cxx.o -L/Users/spataro/apr13/apr13build/lib/root -L/Users/spataro/apr13/apr13build/lib ../../lib/libEvtGen.0.0.0.so -L/Users/spataro/apr13/apr13build//lib/root -lGui -lCore -lCint -lRIO -lNet -lHist -lGraf -lGraf3d -lGpad -lTree -lRint -lPostscript -lMatrix -lPhysics -lMathCore -lThread -lpthread -lm -ldl -lPythia6 ../../lib/libPhotos.0.0.0.so -lgfortran 
ld: library not found for -lgfortran
clang: error: linker command failed with exit code 1 (use -v to see invocation)
make[2]: *** [lib/libEvtGenDirect.0.0.0.so] Error 1
make[1]: *** [pgenerators/EvtGenDirect/CMakeFiles/EvtGenDirect.dir/all] Error 2
make: *** [all] Error 2
MacBook-Pro-di-Stefano:build spataro$ 
 
Read Message
Read Message
Read Message
Read Message
Read Message
Read Message
Read Message
Previous Topic: [FIXED] method missing in RhoCandidate
Next Topic: [FIXED] Error while compling pandaroot in macbook pro
Goto Forum:
  


Current Time: Sun May 19 16:43:18 CEST 2024

Total time taken to generate the page: 0.01119 seconds