GSI Forum
GSI Helmholtzzentrum für Schwerionenforschung

Home » PANDA » PandaRoot » Bugs, Fixes, Releases » [FIXED] svn update error
Re: svn update error [message #14563 is a reply to message #14562] Wed, 03 April 2013 17:44 Go to previous messageGo to previous message
Gianluigi Boca is currently offline  Gianluigi Boca
Messages: 177
Registered: March 2004
first-grade participant
From: *pv.infn.it
fixed. Corrected version in trunk repository

Gianluigi

Garzia Isabella wrote on Wed, 03 April 2013 11:00

Hi all,
I updated my pandaroot environment (svn update) and I found the following error:
...
...
[ 54%] Generating PndTrackingDict.cxx, PndTrackingDict.h
Scanning dependencies of target Tracking
[ 54%] Building CXX object tracking/CMakeFiles/Tracking.dir/PndTrkLegendreFits.cxx.o
[ 54%] Building CXX object tracking/CMakeFiles/Tracking.dir/PndTrkTracking.cxx.o
/home/garzia/sep12/pandaroot/tracking/PndTrkTracking.cxx: In member function ‘void PndTrkTracking::Initialization_ClassVariables()’:
/home/garzia/sep12/pandaroot/tracking/PndTrkTracking.cxx:308:15: error: ‘fnParContigue’ was not declared in this scope
/home/garzia/sep12/pandaroot/tracking/PndTrkTracking.cxx:311:15: error: ‘fListParContiguous’ was not declared in this scope
/home/garzia/sep12/pandaroot/tracking/PndTrkTracking.cxx: In member function ‘virtual InitStatus PndTrkTracking::Init()’:
/home/garzia/sep12/pandaroot/tracking/PndTrkTracking.cxx:617:2: error: ‘fnParContigue’ was not declared in this scope
/home/garzia/sep12/pandaroot/tracking/PndTrkTracking.cxx:618:2: error: ‘fListParContiguous’ was not declared in this scope
make[2]: *** [tracking/CMakeFiles/Tracking.dir/PndTrkTracking.cxx.o] Error 1
make[1]: *** [tracking/CMakeFiles/Tracking.dir/all] Error 2
make: *** [all] Error 2


I had a look int he code and seems that "fnParContigue" and "fListParContiguous" are not defined (in PndTrkTracking.h).
Can somebody fix it?

Thanks in advance,

Isabella

 
Read Message
Read Message
Read Message
Read Message
Read Message
Read Message
Read Message
Read Message
Previous Topic: [WONTFIX] Error: Symbol PndTpcDetector is not defined in current scope runMvdSim.C:54:
Next Topic: [INFO] New version of the external packages "apr 13"
Goto Forum:
  


Current Time: Tue Mar 05 00:58:25 CET 2024

Total time taken to generate the page: 0.01193 seconds