GSI Forum
GSI Helmholtzzentrum für Schwerionenforschung

Home » PANDA » PandaRoot » Bugs, Fixes, Releases » TPC compilation problem
TPC compilation problem [message #12790] Fri, 18 November 2011 12:30 Go to previous message
Yuri Naryshkin is currently offline  Yuri Naryshkin
Messages: 42
Registered: August 2008
continuous participant
From: *desy.de
Dear TPC experts,
I have a problem with TPC while compiling PANDAroot:

[ 47%] Building CXX object tpc/CMakeFiles/Tpc.dir/TestBench/PndTpcSLResidualTask.cxx.o
[ 47%] Building CXX object tpc/CMakeFiles/Tpc.dir/TestBench/PndTpcResidualTask.cxx.o
/u/naryshk/pandaroot_new/pandaroot/tpc/TestBench/PndTpcResidualTask.cxx: In member function 'virtual void PndTpcResidualTask::Exec(const Option_t*)':
/u/naryshk/pandaroot_new/pandaroot/tpc/TestBench/PndTpcResidualTask.cxx: 260: error: 'getSmoothedPosXYZ' is not a member of 'GFTools'
make[2]: *** [tpc/CMakeFiles/Tpc.dir/TestBench/PndTpcResidualTask.cxx.o] Error 1
make[1]: *** [tpc/CMakeFiles/Tpc.dir/all] Error 2
make: *** [all] Error 2

May I ask you what is the solution for that?
I used:
svn co https://subversion.gsi.de/fairroot/pandaroot/trunk pandaroot

and

settings:
export SIMPATH=/misc/cbmsoft/Lenny32/may11/fairsoft/

Best Regards, Yuri.
 
Read Message
Read Message
Read Message
Read Message
Read Message
Read Message
Read Message
Read Message
Previous Topic: compiling PANDAroot
Next Topic: dlopen error from parbase.so
Goto Forum:
  


Current Time: Sat Nov 27 07:14:20 CET 2021

Total time taken to generate the page: 0.01962 seconds