GSI Forum
GSI Helmholtzzentrum für Schwerionenforschung

Home » PANDA » PandaRoot » Bugs, Fixes, Releases » compiling PANDAroot
compiling PANDAroot [message #12784] Thu, 17 November 2011 20:46 Go to previous message
Yuri Naryshkin is currently offline  Yuri Naryshkin
Messages: 42
Registered: August 2008
continuous participant
From: *desy.de
Dear Colleagues,
after a short break I try ti install latest version of PANDAroot on lxi038 inmy home dir. I follow the instruction described in:
http://cbmroot.gsi.de/installation/Installing%20PandaRoot.htm
Everything is working OK up to
make

I've got an error message:
[ 39%] Building Fortran object pgenerators/EvtGen/CMakeFiles/EvtGen.dir/EvtGenModels/lucomp_beg.F.o
[ 39%] Building Fortran object pgenerators/EvtGen/CMakeFiles/EvtGen.dir/EvtGenModels/lucomp.F.o
[ 39%] Building Fortran object pgenerators/EvtGen/CMakeFiles/EvtGen.dir/Cernlib/ddilog.F.o
[ 39%] Building Fortran object pgenerators/EvtGen/CMakeFiles/EvtGen.dir/Cernlib/ranf.F.o
Linking Fortran shared library ../../lib/libEvtGen.so
[ 39%] Built target EvtGen
Scanning dependencies of target EvtGen_exe_simpleEvtGen
[ 39%] Building CXX object pgenerators/EvtGen/CMakeFiles/EvtGen_exe_simpleEvtGen.dir/simpleEvtGen.c c.o
In file included from /misc/cbmsoft/Etch32/jan10/fairsoft/cern/clhep/include/CLHEP/Vector/Thre eVector.h:445,
from /misc/cbmsoft/Etch32/jan10/fairsoft/cern/clhep/include/CLHEP/Vector/Lore ntzVector.h:30,
from /u/naryshk/pandaroot_new/pandaroot/pgenerators/EvtGen/EvtGen.hh:33,
from /u/naryshk/pandaroot_new/pandaroot/pgenerators/EvtGen/simpleEvtGen.cc:11 :
/misc/cbmsoft/Etch32/jan10/fairsoft/cern/clhep/include/CLHEP/Vector/Thre eVector.icc: In member function 'void CLHEP::Hep3Vector::setX(double)':
/misc/cbmsoft/Etch32/jan10/fairsoft/cern/clhep/include/CLHEP/Vector/Thre eVector.icc:32: warning: declaration of 'x' shadows a member of 'this'
/misc/cbmsoft/Etch32/jan10/fairsoft/cern/clhep/include/CLHEP/Vector/Thre eVector.icc: In member function 'void CLHEP::Hep3Vector::setY(double)':
/misc/cbmsoft/Etch32/jan10/fairsoft/cern/clhep/include/CLHEP/Vector/Thre eVector.icc:33: warning: declaration of 'y' shadows a member of 'this'
/misc/cbmsoft/Etch32/jan10/fairsoft/cern/clhep/include/CLHEP/Vector/Thre eVector.icc: In member function 'void CLHEP::Hep3Vector::setZ(double)':
/misc/cbmsoft/Etch32/jan10/fairsoft/cern/clhep/include/CLHEP/Vector/Thre eVector.icc:34: warning: declaration of 'z' shadows a member of 'this'
/misc/cbmsoft/Etch32/jan10/fairsoft/cern/clhep/include/CLHEP/Vector/Thre eVector.icc: In member function 'void CLHEP::Hep3Vector::set(double, double, double)':
/misc/cbmsoft/Etch32/jan10/fairsoft/cern/clhep/include/CLHEP/Vector/Thre eVector.icc:36: warning: declaration of 'z' shadows a member of 'this'
/misc/cbmsoft/Etch32/jan10/fairsoft/cern/clhep/include/CLHEP/Vector/Thre eVector.icc:36: warning: declaration

.........

/misc/cbmsoft/Etch32/jan10/fairsoft/cern/clhep/include/CLHEP/Vector/Lore ntzVector.icc:356: warning: declaration of 'z' shadows a member of 'this'
/misc/cbmsoft/Etch32/jan10/fairsoft/cern/clhep/include/CLHEP/Vector/Lore ntzVector.icc:356: warning: declaration of 'phi' shadows a member of 'this'
/misc/cbmsoft/Etch32/jan10/fairsoft/cern/clhep/include/CLHEP/Vector/Lore ntzVector.icc:356: warning: declaration of 'rho' shadows a member of 'this'
Linking Fortran executable ../../bin/simpleEvtGen
/usr/bin/ld: warning: libgfortran.so.1, needed by /misc/cbmsoft/Etch32/jan10/fairsoft/generators/lib/libPythia6.so, not found (try using -rpath or -rpath-link)
/misc/cbmsoft/Etch32/jan10/fairsoft/generators/lib/libPythia6.so: undefined reference to `_gfortran_pow_r8_i4'
/misc/cbmsoft/Etch32/jan10/fairsoft/generators/lib/libPythia6.so: undefined reference to `_gfortran_internal_free'
/misc/cbmsoft/Etch32/jan10/fairsoft/generators/lib/libPythia6.so: undefined reference to `_gfortran_copy_string'
/misc/cbmsoft/Etch32/jan10/fairsoft/generators/lib/libPythia6.so: undefined reference to `_gfortran_internal_malloc'
collect2: ld returned 1 exit status
make[2]: *** [bin/simpleEvtGen] Error 1
make[1]: *** [pgenerators/EvtGen/CMakeFiles/EvtGen_exe_simpleEvtGen.dir/all] Error 2
make: *** [all] Error 2


Does anyone known this problem ?
Best Regards, Yuri.
 
Read Message
Read Message
Read Message
Read Message
Read Message
Read Message
Read Message
Previous Topic: eta_c drop in efficiency
Next Topic: TPC compilation problem
Goto Forum:
  


Current Time: Mon Nov 29 21:00:22 CET 2021

Total time taken to generate the page: 0.02028 seconds