GSI Forum
GSI Helmholtzzentrum für Schwerionenforschung

Home » PANDA » PandaRoot » Bugs, Fixes, Releases » Pandaroot version 12806 Crash
Re: Pandaroot version 12806 Crash [message #12328 is a reply to message #12324] Fri, 22 July 2011 10:47 Go to previous messageGo to previous message
Elisa Fioravanti is currently offline  Elisa Fioravanti
Messages: 84
Registered: January 2008
continuous participant
From: *fe.infn.it
Hello Tobias,
unfortunately I have another crash at 51%. Sad

[ 51%] Building CXX object sds/CMakeFiles/Sds.dir/SdsDigi/PndSdsStripHitProducer.cxx.o
/home/fioravanti/fairsoft/pandaroot/sds/SdsDigi/PndSdsStripHitProducer.c xx: In member function ‘virtual void PndSdsStripHitProducer::Exec(const Option_t*)’:
/home/fioravanti/fairsoft/pandaroot/sds/SdsDigi/PndSdsStripHitProducer.c xx:198: error: conversion from ‘void’ to non-scalar type ‘std::vector<PndSdsDigiStrip, std::allocator<PndSdsDigiStrip> >’ requested
/home/fioravanti/fairsoft/pandaroot/sds/SdsDigi/PndSdsStripHitProducer.c xx:320: warning: converting to ‘Int_t’ from ‘Double_t’
/home/fioravanti/fairsoft/pandaroot/sds/SdsDigi/PndSdsStripHitProducer.c xx: In member function ‘Int_t PndSdsStripHitProducer::DigitizeTime(Double_t, Double_t)’:
/home/fioravanti/fairsoft/pandaroot/sds/SdsDigi/PndSdsStripHitProducer.c xx:401: warning: converting to ‘Int_t’ from ‘Double_t’
/home/fioravanti/fairsoft/pandaroot/sds/SdsDigi/PndSdsStripHitProducer.c xx: In member function ‘virtual void PndSdsStripHitProducer::FinishTask()’:
/home/fioravanti/fairsoft/pandaroot/sds/SdsDigi/PndSdsStripHitProducer.c xx:428: error: conversion from ‘void’ to non-scalar type ‘std::vector<PndSdsDigiStrip, std::allocator<PndSdsDigiStrip> >’ requested
make[2]: *** [sds/CMakeFiles/Sds.dir/SdsDigi/PndSdsStripHitProducer.cxx.o] Error 1
make[1]: *** [sds/CMakeFiles/Sds.dir/all] Error 2
make: *** [all] Error 2

Thanks a lot
Elisa
 
Read Message
Read Message
Read Message
Read Message
Read Message
Read Message
Read Message
Previous Topic: D+ and D- vertex resolution from Psi analysis
Next Topic: TPC does not compile (r 13164)
Goto Forum:
  


Current Time: Wed Jun 19 16:42:38 CEST 2024

Total time taken to generate the page: 0.01155 seconds