GSI Forum
GSI Helmholtzzentrum für Schwerionenforschung

Home » PANDA » PandaRoot » Bugs, Fixes, Releases » Pandaroot version 12806 Crash
Re: Pandaroot version 12806 Crash [message #12326 is a reply to message #12324] Fri, 22 July 2011 09:37 Go to previous messageGo to previous message
Elisa Fioravanti is currently offline  Elisa Fioravanti
Messages: 84
Registered: January 2008
continuous participant
From: *fe.infn.it
Hello Tobias,

thanks for you quick reply Smile
But unfortunately I have another error:

[ 50%] Building CXX object sds/CMakeFiles/Sds.dir/SdsDigi/PndSdsHybridHitProducer.cxx.o
/home/fioravanti/fairsoft/pandaroot/sds/SdsDigi/PndSdsHybridHitProducer. cxx: In member function ‘virtual void PndSdsHybridHitProducer::Exec(const Option_t*)’:
/home/fioravanti/fairsoft/pandaroot/sds/SdsDigi/PndSdsHybridHitProducer. cxx:201: error: conversion from ‘void’ to non-scalar type ‘std::vector<PndSdsDigiPixel, std::allocator<PndSdsDigiPixel> >’ requested
/home/fioravanti/fairsoft/pandaroot/sds/SdsDigi/PndSdsHybridHitProducer. cxx: In member function ‘virtual void PndSdsHybridHitProducer::FinishTask()’:
/home/fioravanti/fairsoft/pandaroot/sds/SdsDigi/PndSdsHybridHitProducer. cxx:515: error: conversion from ‘void’ to non-scalar type ‘std::vector<PndSdsDigiPixel, std::allocator<PndSdsDigiPixel> >’ requested
make[2]: *** [sds/CMakeFiles/Sds.dir/SdsDigi/PndSdsHybridHitProducer.cxx.o] Error 1
make[1]: *** [sds/CMakeFiles/Sds.dir/all] Error 2
make: *** [all] Error 2

Thanks
Elisa
 
Read Message
Read Message
Read Message
Read Message
Read Message
Read Message
Read Message
Previous Topic: D+ and D- vertex resolution from Psi analysis
Next Topic: TPC does not compile (r 13164)
Goto Forum:
  


Current Time: Thu Jun 20 07:51:54 CEST 2024

Total time taken to generate the page: 0.01121 seconds