GSI Forum
GSI Helmholtzzentrum für Schwerionenforschung

Home » PANDA » PandaRoot » Bugs, Fixes, Releases » trunk doesnt compile
trunk doesnt compile [message #8801] Fri, 05 June 2009 09:59 Go to previous message
Anonymous Poster From: *pool.einsundeins.de
Hi,

I get the following error.

96%] Building CXX object PndTools/MVA/CMakeFiles/Mva.dir/ProjectedKNN/PndProjectedKNN.o
In file included from /Users/hoeppi/trunk/PndTools/MVA/kd_KNN/PndKnnClassify.h:25,
from /Users/hoeppi/trunk/PndTools/MVA/ProjectedKNN/PndProjectedKNN.h:8,
from /Users/hoeppi/trunk/PndTools/MVA/ProjectedKNN/PndProjectedKNN.cpp:1:
/Users/hoeppi/trunk/PndTools/MVA/kd_KNN/kdtree2.hpp:24:33: error: boost/multi_array.hpp: No such file or directory
/Users/hoeppi/trunk/PndTools/MVA/kd_KNN/kdtree2.hpp:25:27: error: boost/array.hpp: No such file or directory
/Users/hoeppi/trunk/PndTools/MVA/kd_KNN/kdtree2.hpp:28: error: expected namespace-name before ';' token
/Users/hoeppi/trunk/PndTools/MVA/kd_KNN/kdtree2.hpp:28: error: '<type error>' is not a namespace
/Users/hoeppi/trunk/PndTools/MVA/kd_KNN/kdtree2.hpp:30: error: expected initializer before '<' token
/Users/hoeppi/trunk/PndTools/MVA/kd_KNN/kdtree2.hpp:31: error: expected initializer before '<' token
/Users/hoeppi/trunk/PndTools/MVA/kd_KNN/kdtree2.hpp:90: error: ISO C++ forbids declaration of 'kdtree2_array' with no type
/Users/hoeppi/trunk/PndTools/MVA/kd_KNN/kdtree2.hpp:90: error: expected ';' before '&' token
/Users/hoeppi/trunk/PndTools/MVA/kd_KNN/kdtree2.hpp:114: error: expected `)' before '&' token
/Users/hoeppi/trunk/PndTools/MVA/kd_KNN/kdtree2.hpp:156: error: ISO C++ forbids declaration of 'kdtree2_array' with no type
/Users/hoeppi/trunk/PndTools/MVA/kd_KNN/kdtree2.hpp:156: error: expected ';' before '*' token
/Users/hoeppi/trunk/PndTools/MVA/kd_KNN/kdtree2.hpp:164: error: 'kdtree2_array' does not name a type
/Users/hoeppi/trunk/PndTools/MVA/kd_KNN/kdtree2.hpp:171: error: 'kdtree2_array' has not been declared
/Users/hoeppi/trunk/PndTools/MVA/kd_KNN/PndKnnClassify.h:32: error: expected initializer before '<' token
make[2]: *** [PndTools/MVA/CMakeFiles/Mva.dir/ProjectedKNN/PndProjectedKNN.o] Error 1
make[1]: *** [PndTools/MVA/CMakeFiles/Mva.dir/all] Error 2

Cheers, Christian
 
Read Message
Read Message
Previous Topic: Problems with g4libs in qa macros
Next Topic: Microcandidates writing fails for large simulation file
Goto Forum:
  


Current Time: Thu Apr 18 02:37:40 CEST 2024

Total time taken to generate the page: 0.01133 seconds