GSI Forum
GSI Helmholtzzentrum für Schwerionenforschung

Home » PANDA » PandaRoot » Bugs, Fixes, Releases » error in compiling pandaroot
Re: error in compiling pandaroot [message #9486 is a reply to message #9485] Wed, 30 September 2009 13:15 Go to previous messageGo to previous message
Garzia Isabella is currently offline  Garzia Isabella
Messages: 11
Registered: January 2009
occasional visitor
From: *
Hi Mohammad,
I try to compile pandaroot with the old external package (jul08) and I had this error:

Scanning dependencies of target Pid
[ 98%] Building CXX object pid/CMakeFiles/Pid.dir/PidData/PndPidCandidate.o
[ 99%] Building CXX object pid/CMakeFiles/Pid.dir/PidData/PndPidProbability.o
[ 99%] Building CXX object pid/CMakeFiles/Pid.dir/PidCorr/PndPidCorrPar.o
[ 99%] Building CXX object pid/CMakeFiles/Pid.dir/PidCorr/PndPidCorrelator.o
[ 99%] Building CXX object pid/CMakeFiles/Pid.dir/PndPidContFact.o
[ 99%] Building CXX object pid/CMakeFiles/Pid.dir/PidClassifier/PndMvaUtil.o
[ 99%] Building CXX object pid/CMakeFiles/Pid.dir/PidClassifier/PndMvaDataSet.o
In file included from /home/panda/fairsoft/pandaroot/trunk/pid/PidClassifier/PndMvaDataSet.cpp :11:
/home/panda/fairsoft/pandaroot/trunk/pid/PidClassifier/PndMvaDataSet.h:2 2:26: error: TMVA/PDEFoam.h: No such file or directory
make[2]: *** [pid/CMakeFiles/Pid.dir/PidClassifier/PndMvaDataSet.o] Error 1
make[1]: *** [pid/CMakeFiles/Pid.dir/all] Error 2
make: *** [all] Error 2

What do you think?

Read Message
Read Message
Read Message
Read Message
Read Message
Read Message
Read Message
Read Message
Read Message
Previous Topic: [Release] Analysis: Rho & PidCandidate
Next Topic: ParamFirst vs. ParamLast
Goto Forum:

Current Time: Sun Dec 10 02:49:52 CET 2023

Total time taken to generate the page: 0.01018 seconds