GSI Forum
GSI Helmholtzzentrum für Schwerionenforschung

Home » PANDA » PandaRoot » General » FairSoft Installation failed on CentOS7
Re: FairSoft Installation failed on CentOS7 [message #25670 is a reply to message #25662] Wed, 09 June 2021 16:50 Go to previous messageGo to previous message
Mark Lattery is currently offline  Mark Lattery
Messages: 9
Registered: June 2021
occasional visitor
From: *wi.res.rr.com
Thank you. Not sure if I implemented this solution correctly, but this also failed. Output below and log attached.

[...]

[root@localhost fairsoft_nov20]# source scl_source enable devtoolset-7
[root@localhost fairsoft_nov20]# cmake --build /home/Panda/fairsoft_nov20/build
[ 0%] Performing configure step for 'clhep'
CMake Error at /home/Panda/fairsoft_nov20/build/Stamp/clhep/clhep-configure-RelWithDebI nfo.cmake:37 (message):
Command failed: 1

'/usr/bin/cmake3' '-DCLHEP_BUILD_CXXSTD=-std=c++14' '-GUnix Makefiles' '-C/home/Panda/fairsoft_nov20/build/tmp/clhep/clhep-cache-RelWithDebInfo .cmake' '/home/Panda/fairsoft_nov20/build/Source/clhep'

See also

/home/Panda/fairsoft_nov20/build/Log/clhep-configure.log


-- Log output is:
loading initial cache file /home/Panda/fairsoft_nov20/build/tmp/clhep/clhep-cache-RelWithDebInfo.cm ake
-- libraries will be installed in /home/Panda/fairsoft_nov20/install/lib
CMake Error at cmake/Modules/ClhepVariables.cmake:178 (message):
c++14 extension is not available for /usr/bin/c++
Call Stack (most recent call first):
cmake/Modules/ClhepVariables.cmake:263 (_clhep_verify_cxx14)
cmake/Modules/ClhepVariables.cmake:310 (_clhep_check_cxxstd)
CMakeLists.txt:66 (clhep_set_compiler_flags)


-- Configuring incomplete, errors occurred!
See also "/home/Panda/fairsoft_nov20/build/Build/clhep/CMakeFiles/CMakeOutput.log ".

CMake Error at /home/Panda/fairsoft_nov20/build/Stamp/clhep/clhep-configure-RelWithDebI nfo.cmake:47 (message):
Stopping after outputting logs.


gmake[2]: *** [Stamp/clhep/clhep-configure] Error 1
gmake[1]: *** [CMakeFiles/clhep.dir/all] Error 2
gmake: *** [all] Error 2






 
Read Message
Read Message
Read Message
Read Message
Read Message
Read Message
Read Message
Read Message
Read Message
Previous Topic: PandaRoot Oct19 failed to install
Next Topic: PandaRoot test failed on CentOS7
Goto Forum:
  


Current Time: Thu Oct 21 20:15:36 CEST 2021

Total time taken to generate the page: 0.02549 seconds