GSI Forum
GSI Helmholtzzentrum für Schwerionenforschung

Home » Fairroot » External Packages » problem with external packages (problem with unpacking gtest)
Re: problem with external packages [message #19513 is a reply to message #19511] Wed, 07 September 2016 12:44 Go to previous messageGo to previous message
Alexandros is currently offline  Alexandros
Messages: 51
Registered: January 2014
Location: KVI
continuous participant
From: *
I tried may16p1 version.
It passed the point of my previous problem, and it did go a long way.
But now i get this one:

In file included from /home/apostolou/fairsoft_may16p1/tools/root/math/vc/include/Vc/Memory:30 :0,
from /home/apostolou/fairsoft_may16p1/tools/root/math/vc/include/Vc/IO:24,
from /home/apostolou/fairsoft_may16p1/tools/root/math/vc/include/Vc/Vc:23,
from /home/apostolou/fairsoft_may16p1/tools/root/math/vc/src/trigonometric.cp p:20:
/home/apostolou/fairsoft_may16p1/tools/root/math/vc/include/Vc/avx/inter leavedmemory.tcc: In substitution of 'template<class S1, class IT1, class IT2> void ROOT::Vc::AVX::Vector<T>::gather(const S1*, const EntryType* const S1::*, IT1, IT2, ROOT::Vc::AVX::Vector<T>::MaskArg) [with S1 = <missing>; IT1 = <missing>; IT2 = <missing>]':
/home/apostolou/fairsoft_may16p1/tools/root/math/vc/include/Vc/avx/inter leavedmemory.tcc:359:39: required from here
/home/apostolou/fairsoft_may16p1/tools/root/math/vc/include/Vc/avx/inter leavedmemory.tcc:359:39: internal compiler error: in strip_typedefs, at cp/tree.c:1374
v4.gather(m_data, m_indexes + I(4));
Please submit a full bug report,
with preprocessed source if appropriate.
See <> for instructions.
make[2]: *** [math/vc/trigonometric_AVX+XOP+FMA4.cpp.o] Error 1
make[1]: *** [math/vc/CMakeFiles/Vc.dir/all] Error 2
make: *** [all] Error 2
**** Checking libraries in /home/apostolou/fairsoft_may16p1/buildfairsoft/lib ****
*** ERROR: root could not be created.
create a symbolic linking for Vc library ....
libVc.a not found in lib dirctory
*** End installation of external packages with Errors***

Read Message
Read Message
Read Message
Read Message
Read Message
Read Message
Read Message
Previous Topic: Compiling ROOT6 with gcc>5
Next Topic: Compilation error root in FairSoft dev
Goto Forum:

Current Time: Tue Jul 23 13:33:56 CEST 2024

Total time taken to generate the page: 0.00677 seconds