GSI Forum
GSI Helmholtzzentrum für Schwerionenforschung

Home » PANDA » PandaRoot » Bugs, Fixes, Releases » [FIXED] error after svn update
Re: error after svn update [message #14340 is a reply to message #14338] Mon, 14 January 2013 12:21 Go to previous messageGo to previous message
Karin Schönning
Messages: 65
Registered: August 2012
Location: Uppsala University
continuous participant
From: *physics.uu.se
Thanks, now that problem seems solved, but at the very end of the compilation a new error occured:

[ 95%] Building CXX object lmd/CMakeFiles/LmdFit.dir/LmdFit/PndLmdLumiFit.cxx.o
/export/home/schonnin/panda/pandaroot/lmd/LmdFit/PndLmdLumiFit.cxx: In member function ‘double PndLmdLumiFit::LumiFit(TH1D*)’:
/export/home/schonnin/panda/pandaroot/lmd/LmdFit/PndLmdLumiFit.cxx:153:3 : error: ‘cout’ was not declared in this scope
/export/home/schonnin/panda/pandaroot/lmd/LmdFit/PndLmdLumiFit.cxx:153:3 : note: suggested alternative:
/usr/include/c++/4.6/iostream:62:18: note: ‘std::cout’
/export/home/schonnin/panda/pandaroot/lmd/LmdFit/PndLmdLumiFit.cxx:157:1 3: error: ‘endl’ was not declared in this scope
/export/home/schonnin/panda/pandaroot/lmd/LmdFit/PndLmdLumiFit.cxx:157:1 3: note: suggested alternative:
/usr/include/c++/4.6/ostream:543:5: note: ‘std::endl’
make[2]: *** [lmd/CMakeFiles/LmdFit.dir/LmdFit/PndLmdLumiFit.cxx.o] Error 1
make[1]: *** [lmd/CMakeFiles/LmdFit.dir/all] Error 2
make: *** [all] Error 2


 
Read Message
Read Message
Read Message
Read Message
Read Message
Read Message
Read Message
Read Message
Read Message
Read Message
Read Message
Read Message
Read Message
Read Message
Read Message
Read Message
Read Message
Read Message
Read Message
Read Message
Read Message
Read Message
Read Message
Read Message
Read Message
Previous Topic: [WARN] Removing candidates while looping over TCandList
Next Topic: make for PndTools/MVA
Goto Forum:
  


Current Time: Tue Oct 26 21:16:27 CEST 2021

Total time taken to generate the page: 0.02369 seconds