GSI Forum
GSI Helmholtzzentrum für Schwerionenforschung

Home » PANDA » PandaRoot » Bugs, Fixes, Releases » pandaroot installation errors [FIXED]
pandaroot installation errors [FIXED] [message #13534] Mon, 28 May 2012 14:50 Go to previous message
Olga Levitskaya is currently offline  Olga Levitskaya
Messages: 3
Registered: April 2012
occasional visitor
From: *fe.infn.it
Dear colleagues!
I installed the last external packages version and with pandaroot installation I have these errors:
Could somebody help, please.

Olga

*********************************************************
[ 56%] Building CXX object tracking/CMakeFiles/Tracking.dir/PndTrkTracking.cxx.o
/home/kashchuk/fairsoft/pandaroot/tracking/PndTrkTracking.cxx: In member function ‘virtual void PndTrkTracking::Exec(const Option_t*)’:
/home/kashchuk/fairsoft/pandaroot/tracking/PndTrkTracking.cxx:1096: error: invalid conversion from ‘UShort_t*’ to ‘Short_t*’
/home/kashchuk/fairsoft/pandaroot/tracking/PndTrkTracking.cxx:1096: error: initializing argument 3 of ‘void PndTrkSttConformalFilling::FromXYtoConformal(Double_t*, Double_t (*)[7], Short_t*, Int_t, Double_t (*)[5], Double_t)’
/home/kashchuk/fairsoft/pandaroot/tracking/PndTrkTracking.cxx:1111: error: invalid conversion from ‘UShort_t*’ to ‘Short_t*’
/home/kashchuk/fairsoft/pandaroot/tracking/PndTrkTracking.cxx:1111: error: initializing argument 1 of ‘void PndTrkSttConformalFilling::BoxConformalFilling(Short_t*, void*, bool*, Double_t (*)[5], Short_t*, Short_t, void*, Short_t, Int_t, Short_t, Double_t*, Short_t*)’
/home/kashchuk/fairsoft/pandaroot/tracking/PndTrkTracking.cxx:1111: error: invalid conversion from ‘UShort_t*’ to ‘Short_t*’
/home/kashchuk/fairsoft/pandaroot/tracking/PndTrkTracking.cxx:1111: error: initializing argument 5 of ‘void PndTrkSttConformalFilling::BoxConformalFilling(Short_t*, void*, bool*, Double_t (*)[5], Short_t*, Short_t, void*, Short_t, Int_t, Short_t, Double_t*, Short_t*)’
/home/kashchuk/fairsoft/pandaroot/tracking/PndTrkTracking.cxx:1111: error: invalid conversion from ‘UShort_t*’ to ‘Short_t*’
/home/kashchuk/fairsoft/pandaroot/tracking/PndTrkTracking.cxx:1111: error: initializing argument 12 of ‘void PndTrkSttConformalFilling::BoxConformalFilling(Short_t*, void*, bool*, Double_t (*)[5], Short_t*, Short_t, void*, Short_t, Int_t, Short_t, Double_t*, Short_t*)’
/home/kashchuk/fairsoft/pandaroot/tracking/PndTrkTracking.cxx:1146: error: invalid conversion from ‘UShort_t*’ to ‘Short_t*’
/home/kashchuk/fairsoft/pandaroot/tracking/PndTrkTracking.cxx:1147: error: invalid conversion from ‘UShort_t*’ to ‘Short_t*’
/home/kashchuk/fairsoft/pandaroot/tracking/PndTrkTracking.cxx:1152: error: invalid conversion from ‘UShort_t*’ to ‘Short_t*’
/home/kashchuk/fairsoft/pandaroot/tracking/PndTrkTracking.cxx:1159: error: invalid conversion from ‘UShort_t*’ to ‘Short_t*’
/home/kashchuk/fairsoft/pandaroot/tracking/PndTrkTracking.cxx:1167: error: invalid conversion from ‘UShort_t*’ to ‘Short_t*’
/home/kashchuk/fairsoft/pandaroot/tracking/PndTrkTracking.cxx:1202: error: invalid conversion from ‘UShort_t*’ to ‘Short_t*’
/home/kashchuk/fairsoft/pandaroot/tracking/PndTrkTracking.cxx:1203: error: invalid conversion from ‘UShort_t*’ to ‘Short_t*’
/home/kashchuk/fairsoft/pandaroot/tracking/PndTrkTracking.cxx:1205: error: invalid conversion from ‘UShort_t*’ to ‘Short_t*’
/home/kashchuk/fairsoft/pandaroot/tracking/PndTrkTracking.cxx:1207: error: invalid conversion from ‘UShort_t*’ to ‘Short_t*’
make[2]: *** [tracking/CMakeFiles/Tracking.dir/PndTrkTracking.cxx.o] Error 1
make[1]: *** [tracking/CMakeFiles/Tracking.dir/all] Error 2
make: *** [all] Error 2

[Updated on: Tue, 29 May 2012 12:32] by Moderator

Report message to a moderator

 
Read Message
Read Message
Read Message
Previous Topic: problem with Geant3 compiling in external packages installation [FIXED]
Next Topic: segmentation violation in pid macro [FIXED]
Goto Forum:
  


Current Time: Thu Oct 21 08:28:37 CEST 2021

Total time taken to generate the page: 0.02289 seconds