GSI Forum
GSI Helmholtzzentrum für Schwerionenforschung

Home » PANDA » PandaRoot » Bugs, Fixes, Releases » fatal error in Event generation
fatal error in Event generation [message #13339] Tue, 17 April 2012 07:28 Go to previous message
Ajay Kumar is currently offline  Ajay Kumar
Messages: 102
Registered: December 2011
Location: indore
continuous participant

From: *iitidr.ac.in
Hi...

I was trying to generate some events by using pandaEvtGen.cc file. As I am compiling this file this shows following error:-

physiclab4@physiclab4-Vostro-460:~/pandaroot3/pgenerators/EvtGen$ root -l pandaEvtGen.cc
root [0]
Processing pandaEvtGen.cc...
Warning in <TClass::TClass>: no dictionary for class EvtVector4R is available
Warning in <TClass::TClass>: no dictionary for class EvtId is available
In file included from /home/physiclab4/pandaroot3/pgenerators/EvtGen/AutoDict_vector_EvtId_.cx x:1,
from /home/physiclab4/pandaroot3/pgenerators/EvtGen/AutoDict_vector_EvtId__cx x_ACLiC_dict.h:34,
from /home/physiclab4/pandaroot3/pgenerators/EvtGen/AutoDict_vector_EvtId__cx x_ACLiC_dict.cxx:17:
/home/physiclab4/pandaroot3/pgenerators/EvtGen/EvtGen.hh:33: fatal error: CLHEP/Vector/LorentzVector.h: No such file or directory
compilation terminated.
g++: /home/physiclab4/pandaroot3/pgenerators/EvtGen/AutoDict_vector_EvtId__cx x_ACLiC_dict.o: No such file or directory
Error in <ACLiC>: Compilation failed!
In file included from /home/physiclab4/pandaroot3/pgenerators/EvtGen/AutoDict_random_access_it erator_EvtId_long_.cxx:1,
from /home/physiclab4/pandaroot3/pgenerators/EvtGen/AutoDict_random_access_it erator_EvtId_long__cxx_ACLiC_dict.h:34,
from /home/physiclab4/pandaroot3/pgenerators/EvtGen/AutoDict_random_access_it erator_EvtId_long__cxx_ACLiC_dict.cxx:17:
/home/physiclab4/pandaroot3/pgenerators/EvtGen/EvtGen.hh:33: fatal error: CLHEP/Vector/LorentzVector.h: No such file or directory
compilation terminated.
g++: /home/physiclab4/pandaroot3/pgenerators/EvtGen/AutoDict_random_access_it erator_EvtId_long__cxx_ACLiC_dict.o: No such file or directory
Error in <ACLiC>: Compilation failed!
In file included from /home/physiclab4/pandaroot3/pgenerators/EvtGen/AutoDict_vector_EvtPartPr op_.cxx:1,
from /home/physiclab4/pandaroot3/pgenerators/EvtGen/AutoDict_vector_EvtPartPr op__cxx_ACLiC_dict.h:34,
from /home/physiclab4/pandaroot3/pgenerators/EvtGen/AutoDict_vector_EvtPartPr op__cxx_ACLiC_dict.cxx:17:
/home/physiclab4/pandaroot3/pgenerators/EvtGen/EvtGen.hh:33: fatal error: CLHEP/Vector/LorentzVector.h: No such file or directory
compilation terminated.
g++: /home/physiclab4/pandaroot3/pgenerators/EvtGen/AutoDict_vector_EvtPartPr op__cxx_ACLiC_dict.o: No such file or directory
Error in <ACLiC>: Compilation failed!
In file included from /home/physiclab4/pandaroot3/pgenerators/EvtGen/AutoDict_random_access_it erator_EvtPartProp_long_.cxx:1,
from /home/physiclab4/pandaroot3/pgenerators/EvtGen/AutoDict_random_access_it erator_EvtPartProp_long__cxx_ACLiC_dict.h:34,
from /home/physiclab4/pandaroot3/pgenerators/EvtGen/AutoDict_random_access_it erator_EvtPartProp_long__cxx_ACLiC_dict.cxx:17:
/home/physiclab4/pandaroot3/pgenerators/EvtGen/EvtGen.hh:33: fatal error: CLHEP/Vector/LorentzVector.h: No such file or directory
compilation terminated.
g++: /home/physiclab4/pandaroot3/pgenerators/EvtGen/AutoDict_random_access_it erator_EvtPartProp_long__cxx_ACLiC_dict.o: No such file or directory
Error in <ACLiC>: Compilation failed!
Error: EvtPartProp() declared but not defined _vector.h:89:
*** Interpreter error recovered ***
Error: ~EvtPartProp() declared but not defined /home/physiclab4/fairsoft2/tools/root/cint/cint/stl/multimap2.dll:-1:
root [1]

what is the solution of this error?
can anybody help me?






AJAY KUMAR
Research scholar
Indian Institute of Technology Indore,Indore
Madhya Pradesh
India
 
Read Message
Read Message
Read Message
Previous Topic: Crash in DIRC with G4
Next Topic: new segmentation violation in sim macro
Goto Forum:
  


Current Time: Sat Oct 23 16:47:05 CEST 2021

Total time taken to generate the page: 0.02322 seconds