GSI Forum
GSI Helmholtzzentrum für Schwerionenforschung

Home » PANDA » PandaRoot » Bugs, Fixes, Releases » Error while installation of Pandaroot on kronos
Error while installation of Pandaroot on kronos [message #21908] Wed, 06 December 2017 14:46 Go to next message
S.Vejdani is currently offline  S.Vejdani
Messages: 1
Registered: January 2014
occasional visitor
From: *
Dear all,

I am trying to install PandaRoot on Kronos, by using the pre-installed versions of FairRoot and FairSoft.
For the analysis I use these version of the code:

FairSoft may16p1
FairRoot v-16.06b
PandaRoot release feb17p1
ROOT version 5

when I try to compile it with make, I get this error:

[ 97%] Built target PndEventDisplay
[ 97%] Linking CXX shared library ../lib/
[ 97%] Built target LmdSensorAligner
[ 98%] Built target LmdTrk
/usr/bin/ld: cannot find -lRecoTasks
/usr/bin/ld: cannot find -lRecoHits
/usr/bin/ld: cannot find -lgenfitAdapters
/usr/bin/ld: cannot find -ltrackrep
collect2: error: ld returned 1 exit status
pid/CMakeFiles/Pid.dir/build.make:934: recipe for target 'lib/' failed
make[2]: *** [lib/] Error 1
CMakeFiles/Makefile2:6763: recipe for target 'pid/CMakeFiles/Pid.dir/all' failed
make[1]: *** [pid/CMakeFiles/Pid.dir/all] Error 2
make[1]: *** Waiting for unfinished jobs....
[ 98%] Built target LmdTool
Makefile:138: recipe for target 'all' failed
make: *** [all] Error 2

Do you have any idea where this error come from and how can I fix it?

With the best regards,

Re: Error while installation of Pandaroot on kronos [message #22465 is a reply to message #21908] Thu, 12 April 2018 13:19 Go to previous message
Ralf Kliemt is currently offline  Ralf Kliemt
Messages: 507
Registered: May 2007
Location: GSI, Darmstadt
first-grade participant

From: *
Dear Solmaz,

We decided to move on to ROOT6. Please use the according FairSoft/FairRoot release.

Previous Topic: Fresh installation, test fails at reco_complete.c
Next Topic: Problems with Fitters
Goto Forum:

Current Time: Wed Jul 24 04:02:56 CEST 2024

Total time taken to generate the page: 0.00733 seconds