GSI Forum
GSI Helmholtzzentrum für Schwerionenforschung

Home » PANDA » PandaRoot » Bugs, Fixes, Releases » Problem in compilation of the new feb17p1 release
Problem in compilation of the new feb17p1 release [message #20810] Wed, 05 April 2017 18:57 Go to next message
Gianluigi Boca is currently offline  Gianluigi Boca
Messages: 177
Registered: March 2004
first-grade participant
From: *pv.infn.it
dear collaborators,

during the compilation of the feb17p1 release I get a totally unexpected crash since it
seems to indicate a bug in the code of stt/PndSttGeometryMap.h which is a header file
that has been there since CENTURIES ....
Here is the crash :

[ 34%] Building CXX object pgenerators/EvtGen/Standalone/CMakeFiles/EvtGen_exe_simpleEvtGenRO.dir/s impleEvtGenRO.cc.o
[ 34%] Linking CXX executable ../../../bin/simpleEvtGenRO
[ 34%] Built target EvtGen_exe_simpleEvtGenRO
[ 34%] Generating G__SttDict.cxx
Error: Symbol delete is not defined in current scope /home/boca/panda/installazione5jan17/pandaroot4apr17/stt/PndSttGeometryM ap.h:30:
Error: Symbol delete is not defined in current scope /home/boca/panda/installazione5jan17/pandaroot4apr17/stt/PndSttGeometryM ap.h:31:
Error: Symbol delete is not defined in current scope /home/boca/panda/installazione5jan17/pandaroot4apr17/stt/PndSttStrawMap. h:28:
Error: Symbol delete is not defined in current scope /home/boca/panda/installazione5jan17/pandaroot4apr17/stt/PndSttStrawMap. h:29:
Warning: Error occurred during reading source files
Warning: Error occurred during dictionary source generation
!!!Removing /home/boca/panda/installazione5jan17/pandaroot4apr17/buildPanda/stt/G__S ttDict.cxx /home/boca/panda/installazione5jan17/pandaroot4apr17/buildPanda/stt/G__S ttDict.h !!!
Error: /home/boca/panda/installazione5jan17/externals_may16p1/fairsoft_may16p1_ libraries/bin/rootcint: error loading headers...
make[2]: *** [stt/G__SttDict.cxx] Error 1
make[1]: *** [stt/CMakeFiles/Stt.dir/all] Error 2
make: *** [all] Error 2

Any idea why anyone ?
Thanks !

Gianluigi
Re: Problem in compilation of the new feb17p1 release [message #20815 is a reply to message #20810] Wed, 05 April 2017 19:12 Go to previous messageGo to next message
StefanoSpataro is currently offline  StefanoSpataro
Messages: 2736
Registered: June 2005
Location: Torino
first-grade participant

From: *ip61.fastwebnet.it
Hi, I have the same problem under Ubuntu 16.04 and trunk, fs may16p1 fr 16.06b root 5 (and maybe also with root 6, I should check again).
Re: Problem in compilation of the new feb17p1 release [message #20821 is a reply to message #20815] Thu, 06 April 2017 09:00 Go to previous messageGo to next message
Ralf Kliemt is currently offline  Ralf Kliemt
Messages: 501
Registered: May 2007
Location: GSI, Darmstadt
first-grade participant

From: *gsi.de
Hi Gianluigi and Stefano,

This error is the incompatibility of ROOT5 with C++11. This should not appear in the feb17 release, because I did the upload to the trunk after the creation of the release. Please re-check that your source code is really the release and not the trunk.

If you want to use trunk code (e.g. stt switched to trunk), please use ROOT6 from now on.

Cheers!
Ralf
Re: Problem in compilation of the new feb17p1 release [message #20823 is a reply to message #20821] Thu, 06 April 2017 14:26 Go to previous message
StefanoSpataro is currently offline  StefanoSpataro
Messages: 2736
Registered: June 2005
Location: Torino
first-grade participant

From: 93.49.150*
Yes, you are right, with root6 it does compile.
Previous Topic: New PandaRoot Release feb17p1
Next Topic: Problem running sim with IdealTrackFinder on Kronos
Goto Forum:
  


Current Time: Sun Aug 09 10:23:16 CEST 2020

Total time taken to generate the page: 0.02440 seconds