GSI Forum
GSI Helmholtzzentrum für Schwerionenforschung

Home » PANDA » PandaRoot » Bugs, Fixes, Releases » Error in charmtask
Error in charmtask [message #5420] Fri, 16 November 2007 08:43 Go to next message
Tobias Stockmanns is currently offline  Tobias Stockmanns
Messages: 489
Registered: May 2007
first-grade participant
From: *ikp.kfa-juelich.de
Hi pandaRooters,

in the latest svn revision 1779 I get the following error, when I try to compile the project:

[ 98%] Generating charmtaskDict.cxx, charmtaskDict.h
Error: link requested for unknown class std::vector<double> /home/stockman/fairroot/cbmsoft/pandaroot/tutorials/charmtask/charmtaskL inkDef.h:9:
Warning: Error occurred during reading source files
Warning: Error occurred during dictionary source generation
!!!Removing /home/stockman/fairroot/cbmsoft/cbuild/tutorials/charmtask/charmtaskDict .cxx /home/stockman/fairroot/cbmsoft/cbuild/tutorials/charmtask/charmtaskDict .h !!!
Error: /home/stockman/fairroot/cbmsoft/tools/root/bin/rootcint: error loading headers...
make[2]: *** [tutorials/charmtask/charmtaskDict.cxx] Error 1
make[1]: *** [tutorials/charmtask/CMakeFiles/charmtask.dir/all] Error 2
make: *** [all] Error 2

I hope somebody can fix this problem Smile

Thanks

Tobias
Re: Error in charmtask [message #5423 is a reply to message #5420] Fri, 16 November 2007 09:03 Go to previous message
Florian Uhlig is currently offline  Florian Uhlig
Messages: 424
Registered: May 2007
first-grade participant
From: *gsi.de
Hi Tobias

The problem was an error in the linkdef file. In revision 1780 this is corrected.

Ciao

Florian
Previous Topic: KalmanFit Error
Next Topic: cmake error
Goto Forum:
  


Current Time: Fri Apr 12 12:37:30 CEST 2024

Total time taken to generate the page: 0.00843 seconds