GSI Forum
GSI Helmholtzzentrum für Schwerionenforschung

Home » Fairroot » General Discussion » Problem installing FairSoft
Problem installing FairSoft [message #23519] Thu, 07 February 2019 14:50 Go to next message
Sahra Wolff is currently offline  Sahra Wolff
Messages: 1
Registered: February 2019
occasional visitor
From: *
Hello everyone,

I am trying to install FairSoft for a while now. This time I was following the instructions, described in the PANDA-wiki #PandaRoot_installation_guide
I get the following error and do not know how to solve it:

/home/sahra/fairsoft_may18/tools/root/interpreter/llvm/src/tools/clang/l ib/Sema/SemaTemplateInstantiateDecl.cpp:340: undefined reference to `clang::Sema::ActOnOpenMPDeclareSimdDirective(clang::OpaquePtr<clang::DeclGroupRef >, clang::OMPDeclareSimdDeclAttr::BranchStateTy, clang::Expr*, llvm::ArrayRef<clang::Expr*>, llvm::ArrayRef<clang::Expr*>, llvm::ArrayRef<clang::Expr*>, llvm::ArrayRef<clang::Expr*>, llvm::ArrayRef<unsigned int>, llvm::ArrayRef<clang::Expr*>, clang::SourceRange)'
collect2: error: ld returned 1 exit status
core/rootcling_stage1/CMakeFiles/rootcling_stage1.dir/build.make:210: recipe for target 'core/rootcling_stage1/src/rootcling_stage1' failed
make[2]: *** [core/rootcling_stage1/src/rootcling_stage1] Error 1
CMakeFiles/Makefile2:17594: recipe for target 'core/rootcling_stage1/CMakeFiles/rootcling_stage1.dir/all' failed
make[1]: *** [core/rootcling_stage1/CMakeFiles/rootcling_stage1.dir/all] Error 2
Makefile:151: recipe for target 'all' failed
make: *** [all] Error 2
**** Checking libraries in /home/sahra/fairsoft_may18/buildFairSoft/lib ****
*** ERROR: root could not be created.
create a symbolic linking for Vc library ....
libVc.a not found in lib dirctory
*** End installation of external packages with Errors***

Can you help me?

[Updated on: Thu, 07 February 2019 14:55]

Report message to a moderator

Re: Problem installing FairSoft [message #23522 is a reply to message #23519] Fri, 08 February 2019 08:12 Go to previous message
Ralf Kliemt is currently offline  Ralf Kliemt
Messages: 507
Registered: May 2007
Location: GSI, Darmstadt
first-grade participant

From: *
Dear Sahra,

Seems the ROOT installation fails.
Which operating system do you run on? There is an issue with ROOT and MacOS Mojave.

Previous Topic: CMake problem compiling FAIRROOT
Next Topic: How to configure cmake when using the current FairRoot/dev?
Goto Forum:

Current Time: Thu May 23 09:02:56 CEST 2024

Total time taken to generate the page: 0.00946 seconds